Target
Acyl-CoA:cholesterol acyltransferase
Ligand
BDBM50047581
Substrate
Meas. Tech.
ChEBML_28332
IC50
68±n/a nM
Citation
 Kimura, TWatanabe, NMatsui, MHayashi, KTanaka, HOhtsuka, ISaeki, TKogushi, MKabayashi, HAkasaka, K Structure-activity relationship of a series of phenylureas linked to 4-phenylimidazole. Novel potent inhibitors of acyl-CoA:cholesterol O-acyltransferase with antiatherosclerotic activity. 2. J Med Chem 36:1641-53 (1993)  
Target
Name:
Acyl-CoA:cholesterol acyltransferase
Synonyms:
ACAT
Type:
Mol. Mass.:
35405.31
Organism:
Oryctolagus cuniculus
Description:
Residue:
305
  
Inhibitor
Name:
BDBM50047581
Synonyms:
1-Hexyl-3-{2-methyl-6-[3-(5-methyl-4-phenyl-imidazol-1-yl)-propoxy]-phenyl}-urea | CHEMBL44863
Type:
Small organic molecule
Emp. Form.:
C27H36N4O2
Mol. Mass.:
448.6003
SMILES:
CCCCCCNC(=O)Nc1c(C)cccc1OCCCn1cnc(c1C)-c1ccccc1
: