Target
Acyl-CoA:cholesterol acyltransferase
Ligand
BDBM50047593
Substrate
Meas. Tech.
ChEBML_28332
IC50
370±n/a nM
Citation
 Kimura, TWatanabe, NMatsui, MHayashi, KTanaka, HOhtsuka, ISaeki, TKogushi, MKabayashi, HAkasaka, K Structure-activity relationship of a series of phenylureas linked to 4-phenylimidazole. Novel potent inhibitors of acyl-CoA:cholesterol O-acyltransferase with antiatherosclerotic activity. 2. J Med Chem 36:1641-53 (1993)  
Target
Name:
Acyl-CoA:cholesterol acyltransferase
Synonyms:
ACAT
Type:
Mol. Mass.:
35405.31
Organism:
Oryctolagus cuniculus
Description:
Residue:
305
  
Inhibitor
Name:
BDBM50047593
Synonyms:
1-(3-Methyl-butyl)-3-{2-methyl-6-[3-(4-phenyl-imidazol-1-yl)-propoxy]-phenyl}-urea | CHEMBL294932
Type:
Small organic molecule
Emp. Form.:
C25H32N4O2
Mol. Mass.:
420.5472
SMILES:
CC(C)CCNC(=O)Nc1c(C)cccc1OCCCn1cnc(c1)-c1ccccc1
: