Target
C3a anaphylatoxin chemotactic receptor
Ligand
BDBM50499183
Substrate
Meas. Tech.
ChEMBL_1538088 (CHEMBL3738949)
EC50
55±n/a nM
Citation
 Singh, RReed, ANChu, PScully, CCYau, MKSuen, JYDurek, TReid, RCFairlie, DP Potent complement C3a receptor agonists derived from oxazole amino acids: Structure-activity relationships. Bioorg Med Chem Lett 25:5604-8 (2015)  
Target
Name:
C3a anaphylatoxin chemotactic receptor
Synonyms:
AZ3B C3AR1 C3R1 HNFAG09
Type:
PROTEIN
Mol. Mass.:
53864.66
Organism:
Homo sapiens (Human)
Description:
ChEMBL_642034
Residue:
482
  
Inhibitor
Name:
BDBM50499183
Synonyms:
CHEMBL3735764
Type:
Small organic molecule
Emp. Form.:
C28H34N6O6
Mol. Mass.:
550.6062
SMILES:
CC[C@H](C)[C@H](NC(=O)c1ccccc1Oc1ccccc1)c1nc(co1)C(=O)N[C@@H](CCCNC(N)=N)C(O)=O
: