Target
Interleukin-1 receptor-associated kinase 4
Ligand
BDBM50499202
Substrate
Meas. Tech.
ChEMBL_1538243 (CHEMBL3737182)
Ki
3.8±n/a nM
Citation
 Wang, ZSun, DJohnstone, SCao, ZGao, XJaen, JCLiu, JLively, SMiao, SSudom, ATomooka, CWalker, NPWright, MYan, XYe, QPowers, JP Discovery of potent, selective, and orally bioavailable inhibitors of interleukin-1 receptor-associate kinase-4. Bioorg Med Chem Lett 25:5546-50 (2015)  
Target
Name:
Interleukin-1 receptor-associated kinase 4
Synonyms:
IRAK-4 IRAK4_HUMAN Interleukin-1 receptor-associated kinase 4 (IRAK4) | Renal carcinoma antigen NY-REN-64
Type:
Protein
Mol. Mass.:
51519.08
Organism:
Homo sapiens (Human)
Description:
Q9NWZ3
Residue:
460
  
Inhibitor
Name:
BDBM50499202
Synonyms:
CHEMBL3735523
Type:
Small organic molecule
Emp. Form.:
C25H29N5O5
Mol. Mass.:
479.5283
SMILES:
O[C@H]1CC[C@@H](CC1)n1c(NC(=O)c2cccc(c2)[N+]([O-])=O)nc2cc(CN3CCOCC3)ccc12
: