Target
cGMP-specific 3',5'-cyclic phosphodiesterase
Ligand
BDBM50048241
Substrate
Meas. Tech.
ChEMBL_157068 (CHEMBL764850)
Ki
>100000±n/a nM
Citation
 Stafford, JAVeal, JMFeldman, PLValvano, NLBaer, PGBrackeen, MFBrawley, ESConnolly, KMDomanico, PLHan, B Introduction of a conformational switching element on a pyrrolidine ring. Synthesis and evaluation of (R*,R*)-(+/-)-methyl 3-acetyl-4-[3- (cyclopentyloxy)-4-methoxyphenyl]-3-methyl-1-pyrrolidinecarboxylate, a potent and selective inhibitor of cAMP-specific phosphodiesterase. J Med Chem 38:4972-5 (1996)  
Target
Name:
cGMP-specific 3',5'-cyclic phosphodiesterase
Synonyms:
3',5'-cyclic phosphodiesterase PDE5 PDE5A_HUMAN Phosphodiesterase 5 (PDE5) Phosphodiesterase 5A (PDE5A) cGMP-specific 3',5'-cyclic phosphodiesterase
Type:
Protein
Mol. Mass.:
99975.83
Organism:
Homo sapiens (Human)
Description:
O76074
Residue:
875
  
Inhibitor
Name:
BDBM50048241
Synonyms:
(3S,4S)-3-Acetyl-4-(3-cyclopentyloxy-4-methoxy-phenyl)-3-methyl-pyrrolidine-1-carboxylic acid methyl ester | CHEMBL344944
Type:
Small organic molecule
Emp. Form.:
C21H29NO5
Mol. Mass.:
375.4587
SMILES:
COC(=O)N1C[C@@H](c2ccc(OC)c(OC3CCCC3)c2)[C@@](C)(C1)C(C)=O
: