Target
Retinoic acid receptor gamma
Ligand
BDBM50048286
Substrate
Meas. Tech.
ChEMBL_196012 (CHEMBL798022)
Ki
>10000±n/a nM
Citation
 Charpentier, BBernardon, JMEustache, JMillois, CMartin, BMichel, SShroot, B Synthesis, structure-affinity relationships, and biological activities of ligands binding to retinoic acid receptor subtypes. J Med Chem 38:4993-5006 (1996)  
Target
Name:
Retinoic acid receptor gamma
Synonyms:
NR1B3 RAR-gamma RARG_HUMAN Retinoic acid receptor gamma | Retinoid receptor
Type:
PROTEIN
Mol. Mass.:
50345.43
Organism:
Homo sapiens (Human)
Description:
ChEMBL_1458016
Residue:
454
  
Inhibitor
Name:
BDBM50048286
Synonyms:
6-(3-Adamantan-1-yl-4-hexyloxy-phenyl)-naphthalene-2-carboxylic acid | CHEMBL149366
Type:
Small organic molecule
Emp. Form.:
C33H38O3
Mol. Mass.:
482.653
SMILES:
CCCCCCOc1ccc(cc1C12CC3CC(CC(C3)C1)C2)-c1ccc2cc(ccc2c1)C(O)=O
: