Target
Retinoic acid receptor alpha
Ligand
BDBM50048290
Substrate
Meas. Tech.
ChEMBL_197413 (CHEMBL799802)
Ki
834±n/a nM
Citation
 Charpentier, BBernardon, JMEustache, JMillois, CMartin, BMichel, SShroot, B Synthesis, structure-affinity relationships, and biological activities of ligands binding to retinoic acid receptor subtypes. J Med Chem 38:4993-5006 (1996)  
Target
Name:
Retinoic acid receptor alpha
Synonyms:
NR1B1 RAR-alpha RARA_HUMAN Retinoic acid receptor alpha/Retinoid X receptor alpha Retinoid receptor
Type:
PROTEIN
Mol. Mass.:
50778.87
Organism:
Homo sapiens (Human)
Description:
ChEMBL_1466191
Residue:
462
  
Inhibitor
Name:
BDBM50048290
Synonyms:
4-[(E)-2-(3-tert-Butyl-4-hydroxy-phenyl)-propenyl]-benzoic acid | CHEMBL348449
Type:
Small organic molecule
Emp. Form.:
C20H22O3
Mol. Mass.:
310.3869
SMILES:
C\C(=C/c1ccc(cc1)C(O)=O)c1ccc(O)c(c1)C(C)(C)C
: