Target
Retinoic acid receptor alpha
Ligand
BDBM50048282
Substrate
Meas. Tech.
ChEMBL_197413 (CHEMBL799802)
Ki
>10000±n/a nM
Citation
 Charpentier, BBernardon, JMEustache, JMillois, CMartin, BMichel, SShroot, B Synthesis, structure-affinity relationships, and biological activities of ligands binding to retinoic acid receptor subtypes. J Med Chem 38:4993-5006 (1996)  
Target
Name:
Retinoic acid receptor alpha
Synonyms:
NR1B1 RAR-alpha RARA_HUMAN Retinoic acid receptor alpha/Retinoid X receptor alpha Retinoid receptor
Type:
PROTEIN
Mol. Mass.:
50778.87
Organism:
Homo sapiens (Human)
Description:
ChEMBL_1466191
Residue:
462
  
Inhibitor
Name:
BDBM50048282
Synonyms:
6-[3-Adamantan-1-yl-4-(1,2-dihydroxy-ethyl)-phenyl]-naphthalene-2-carboxylic acid | CHEMBL357603
Type:
Small organic molecule
Emp. Form.:
C29H30O4
Mol. Mass.:
442.5461
SMILES:
OCC(O)c1ccc(cc1C12CC3CC(CC(C3)C1)C2)-c1ccc2cc(ccc2c1)C(O)=O
: