Target
Plasma kallikrein
Ligand
BDBM50499242
Substrate
Meas. Tech.
ChEMBL_1540253 (CHEMBL3738914)
Ki
64±n/a nM
Citation
 Xu, PXu, MJiang, LYang, QLuo, ZDauter, ZHuang, MAndreasen, PA Design of Specific Serine Protease Inhibitors Based on a Versatile Peptide Scaffold: Conversion of a Urokinase Inhibitor to a Plasma Kallikrein Inhibitor. J Med Chem 58:8868-76 (2015)  
Target
Name:
Plasma kallikrein
Synonyms:
Fletcher factor KLKB1 Kallikrein Plasma kallikrein heavy chain Plasma prekallikrein
Type:
Protein
Mol. Mass.:
71391.16
Organism:
Homo sapiens (Human)
Description:
P03952
Residue:
638
  
Inhibitor
Name:
BDBM50499242
Synonyms:
CHEMBL3736473
Type:
Small organic molecule
Emp. Form.:
C55H89N17O12S2
Mol. Mass.:
1244.532
SMILES:
[H][C@@]12CCCN1C(=O)[C@@H](N)CSSC[C@@H](NC(=O)[C@H](CCCCNC(C)=O)NC(=O)[C@H](CC(C)C)NC(=O)[C@H](C)NC(=O)[C@H](CC1CCN(CC1)C(N)=N)NC(=O)[C@H](Cc1ccccc1)NC(=O)[C@H](CCCNC(N)=N)NC(=O)[C@H](C)NC2=O)C(O)=O
: