Target
Breakpoint cluster region protein/Tyrosine-protein kinase ABL1
Ligand
BDBM50462183
Substrate
Meas. Tech.
ChEMBL_1538999 (CHEMBL3738002)
EC50
20±n/a nM
Citation
 Liu, XKung, AMalinoski, BPrakash, GKZhang, C Development of Alkyne-Containing Pyrazolopyrimidines To Overcome Drug Resistance of Bcr-Abl Kinase. J Med Chem 58:9228-37 (2015)  
Target
Name:
Breakpoint cluster region protein/Tyrosine-protein kinase ABL1
Synonyms:
Bcr-Abl Breakpoint cluster region protein /Tyrosine-protein kinase ABL | Tyrosine-protein kinase ABL1/Breakpoint cluster region protein
Type:
Enzyme
Mol. Mass.:
Description:
Components:
This complex has 2 components.
Component 1
Name:
Tyrosine-protein kinase ABL1
Synonyms:
ABL ABL1_HUMAN JTK7 Proto-oncogene tyrosine-protein kinase ABL1 Tyrosine-protein kinase ABL V-abl Abelson murine leukemia viral oncogene homolog 1 p150 | tyrosine-protein kinase ABL1 isoform a
Type:
Enzyme
Mol. Mass.:
122897.30
Organism:
Homo sapiens (Human)
Description:
P00519
Residue:
1130
  
Component 2
Name:
Breakpoint cluster region protein
Synonyms:
BCR BCR_HUMAN Breakpoint cluster region protein | D22S11
Type:
PROTEIN
Mol. Mass.:
142824.75
Organism:
Homo sapiens (Human)
Description:
ChEMBL_305348
Residue:
1271
  
Inhibitor
Name:
BDBM50462183
Synonyms:
CHEMBL3736320
Type:
Small organic molecule
Emp. Form.:
C24H19F3N6O
Mol. Mass.:
464.4425
SMILES:
CC(C)n1nc(C#Cc2cccc(NC(=O)c3cccc(c3)C(F)(F)F)c2)c2c(N)ncnc12
: