Target
Type-1 angiotensin II receptor
Ligand
BDBM25761
Substrate
Meas. Tech.
ChEMBL_1539157 (CHEMBL3738801)
EC50
<5012±n/a nM
Citation
 Rombouts, FJTovar, FAustin, NTresadern, GTrabanco, AA Benzazaborinines as Novel Bioisosteric Replacements of Naphthalene: Propranolol as an Example. J Med Chem 58:9287-95 (2015)  
Target
Name:
Type-1 angiotensin II receptor
Synonyms:
AGTR1 AGTR1B AT1 AT1BR AT2R1B Angiotensin II receptor Type-1 angiotensin II receptor (AT1)
Type:
Protein
Mol. Mass.:
41080.75
Organism:
Homo sapiens (Human)
Description:
P30556
Residue:
359
  
Inhibitor
Name:
BDBM25761
Synonyms:
Anapriline CHEMBL27 PROPRANOLOL, d PROPRANOLOL,(+) Propanolol Propranolol | [2-hydroxy-3-(naphthalen-1-yloxy)propyl](propan-2-yl)amine
Type:
Small organic molecule
Emp. Form.:
C16H21NO2
Mol. Mass.:
259.3434
SMILES:
CC(C)NCC(O)COc1cccc2ccccc12
: