Target
Epidermal growth factor receptor
Ligand
BDBM50009860
Substrate
Meas. Tech.
ChEMBL_1542269 (CHEMBL3745491)
IC50
>10000±n/a nM
Citation
 Zhang, YTortorella, MDLiao, JQin, XChen, TLuo, JGuan, JTalley, JJTu, Z Synthesis and Evaluation of Novel Erlotinib-NSAID Conjugates as More Comprehensive Anticancer Agents. ACS Med Chem Lett 6:1086-90 (2015)  
Target
Name:
Epidermal growth factor receptor
Synonyms:
EGF Receptor Substrate EGFR_HUMAN ERBB1 Epidermal Growth Factor Receptor erbB-1 Epidermal growth factor receptor (EGFR) HER1 Proto-oncogene c-ErbB-1 Tyrosine-Protein Kinase ErbB-1
Type:
Receptor Kinase Domain
Mol. Mass.:
134279.59
Organism:
Homo sapiens (Human)
Description:
P00533
Residue:
1210
  
Inhibitor
Name:
BDBM50009860
Synonyms:
2-(6-Methoxy-naphthalen-2-yl)-propionic acid 2-(6-methoxy-2-naphthyl)propanoic acid CHEMBL154 Naproxen2-(6-Methoxy-naphthalen-2-yl)-propionic acid
Type:
Small organic molecule
Emp. Form.:
C14H14O3
Mol. Mass.:
230.2592
SMILES:
COc1ccc2cc(ccc2c1)C(C)C(O)=O
: