Target
Cytochrome P450 2A6
Ligand
BDBM50499775
Substrate
Meas. Tech.
ChEMBL_1541188 (CHEMBL3745190)
Ki
3.1±n/a nM
Citation
 Vaarla, KKesharwani, RKSantosh, KVedula, RRKotamraju, SToopurani, MK Synthesis, biological activity evaluation and molecular docking studies of novel coumarin substituted thiazolyl-3-aryl-pyrazole-4-carbaldehydes. Bioorg Med Chem Lett 25:5797-803 (2015)  
Target
Name:
Cytochrome P450 2A6
Synonyms:
1,4-cineole 2-exo-monooxygenase CP2A6_HUMAN CYP2A6 Coumarin 7-hydroxylase Cytochrome P450 IIA3 | Cytochrome P450(I)
Type:
Protein
Mol. Mass.:
56514.34
Organism:
Homo sapiens (Human)
Description:
P11509
Residue:
494
  
Inhibitor
Name:
BDBM50499775
Synonyms:
CHEMBL3740871
Type:
Small organic molecule
Emp. Form.:
C22H11Cl2N3O3S
Mol. Mass.:
468.312
SMILES:
Clc1cc(Cl)c2oc(=O)c(cc2c1)-c1csc(n1)-n1cc(C=O)c(n1)-c1ccccc1
: