Target
Polyphenol oxidase 2
Ligand
BDBM50240041
Substrate
Meas. Tech.
ChEMBL_1541432 (CHEMBL3743600)
Ki
300±n/a nM
Citation
 Choi, JPark, SJJee, JG Analogues of ethionamide, a drug used for multidrug-resistant tuberculosis, exhibit potent inhibition of tyrosinase. Eur J Med Chem 106:157-66 (2015)  
Target
Name:
Polyphenol oxidase 2
Synonyms:
Monophenol monooxygenase PPO2 Tyrosinase
Type:
Protein
Mol. Mass.:
63923.66
Organism:
Agaricus bisporus (Common mushroom)
Description:
O42713
Residue:
556
  
Inhibitor
Name:
BDBM50240041
Synonyms:
1-phenyl-2-thiourea CHEMBL263376 N-Phenylthiourea | phenylthiourea
Type:
Small organic molecule
Emp. Form.:
C7H8N2S
Mol. Mass.:
152.217
SMILES:
NC(=S)Nc1ccccc1
: