Target
Gamma-aminobutyric acid receptor subunit alpha-1/beta-2/gamma-2
Ligand
BDBM26267
Substrate
Meas. Tech.
ChEMBL_69935 (CHEMBL679465)
Ki
15±n/a nM
Citation
 Jacobsen, EJTenBrink, REStelzer, LSBelonga, KLCarter, DBIm, HKIm, WBSethy, VHTang, AHVonVoigtlander, PFPetke, JD High-affinity partial agonist imidazo[1,5-a]quinoxaline amides, carbamates, and ureas at the gamma-aminobutyric acid A/benzodiazepine receptor complex. J Med Chem 39:158-75 (1996)  
Target
Name:
Gamma-aminobutyric acid receptor subunit alpha-1/beta-2/gamma-2
Synonyms:
GABA receptor alpha-1/beta-2/gamma-2 subunit | GABA-A receptor; alpha-1/beta-2/gamma-2
Type:
Protein
Mol. Mass.:
Description:
Components:
This complex has 3 components.
Component 1
Name:
Gamma-aminobutyric acid receptor subunit alpha-1
Synonyms:
Benzodiazepine central GABA A Benzodiazepine liver GABA(A) receptor subunit alpha-1 GABA-A receptor GBRA1_HUMAN TBPS | agonist GABA site
Type:
Protein
Mol. Mass.:
51817.35
Organism:
Homo sapiens (Human)
Description:
P14867
Residue:
456
  
Component 2
Name:
Gamma-aminobutyric acid receptor subunit beta-2
Synonyms:
GABA(A) receptor subunit beta-2 GBRB2_HUMAN
Type:
PROTEIN
Mol. Mass.:
59167.91
Organism:
Homo sapiens (Human)
Description:
EBI_221
Residue:
512
  
Component 3
Name:
Gamma-aminobutyric acid receptor subunit gamma-2
Synonyms:
GABA(A) receptor subunit gamma-2 GBRG2_HUMAN
Type:
PROTEIN
Mol. Mass.:
54172.74
Organism:
Homo sapiens (Human)
Description:
EBI_217
Residue:
467
  
Inhibitor
Name:
BDBM26267
Synonyms:
RO-154513 [3H]Ro15-4513 | ethyl 12-azido-8-methyl-9-oxo-2,4,8-triazatricyclo[8.4.0.0^{2,6}]tetradeca-1(10),3,5,11,13-pentaene-5-carboxylate
Type:
radiolabeled ligand
Emp. Form.:
C15H14N6O3
Mol. Mass.:
326.3101
SMILES:
CCOC(=O)c1ncn-2c1CN(C)C(=O)c1cc(ccc-21)N=[N+]=[N-]
: