Target
Tumor necrosis factor
Ligand
BDBM50048944
Substrate
Meas. Tech.
ChEMBL_212395 (CHEMBL873375)
IC50
>200000±n/a nM
Citation
 Cottam, HBShih, HTehrani, LRWasson, DBCarson, DA Substituted xanthines, pteridinediones, and related compounds as potential antiinflammatory agents. Synthesis and biological evaluation of inhibitors of tumor necrosis factor alpha. J Med Chem 39:2-9 (1996)  
Target
Name:
Tumor necrosis factor
Synonyms:
Cachectin TNF-a TNFA TNFSF2 Tumor necrosis factor (TNFa) Tumor necrosis factor ligand superfamily member 2 Tumor necrosis factor, soluble form | tumor necrosis factor alpha
Type:
Enzyme
Mol. Mass.:
25645.11
Organism:
Homo sapiens (Human)
Description:
P01375
Residue:
233
  
Inhibitor
Name:
BDBM50048944
Synonyms:
4-(1-Methyl-2,4-dioxo-1,4-dihydro-2H-pteridin-3-yl)-butyric acid | CHEMBL169882
Type:
Small organic molecule
Emp. Form.:
C11H12N4O4
Mol. Mass.:
264.2374
SMILES:
Cn1c2nccnc2c(=O)n(CCCC(O)=O)c1=O
: