Target
Acid ceramidase
Ligand
BDBM367209
Substrate
Meas. Tech.
ChEMBL_1542475 (CHEMBL3743922)
IC50
0.800000±n/a nM
Citation
 Bach, APizzirani, DRealini, NVozella, VRusso, DPenna, IMelzig, LScarpelli, RPiomelli, D Benzoxazolone Carboxamides as Potent Acid Ceramidase Inhibitors: Synthesis and Structure-Activity Relationship (SAR) Studies. J Med Chem 58:9258-72 (2015)  
Target
Name:
Acid ceramidase
Synonyms:
ASAH ASAH1_HUMAN Acid ceramidase (AC)
Type:
Enzyme
Mol. Mass.:
44662.65
Organism:
Homo sapiens (Human)
Description:
Q13510
Residue:
395
  
Inhibitor
Name:
BDBM367209
Synonyms:
2-oxo-4-phenyl-N-(4- phenylbutyl)-1,3- benzoxazole-3-carboxamide | US10226452, Example 26
Type:
Small organic molecule
Emp. Form.:
C24H22N2O3
Mol. Mass.:
386.4431
SMILES:
O=C(NCCCCc1ccccc1)n1c2c(cccc2oc1=O)-c1ccccc1
: