Target
5-hydroxytryptamine receptor 1D
Ligand
BDBM50049085
Substrate
Meas. Tech.
ChEMBL_1639 (CHEMBL616731)
Ki
9.7±n/a nM
Citation
 Glennon, RAHong, SSBondarev, MLaw, HDukat, MRakhi, SPower, PFan, EKinneau, DKamboj, RTeitler, MHerrick-Davis, KSmith, C Binding of O-alkyl derivatives of serotonin at human 5-HT1D beta receptors. J Med Chem 39:314-22 (1996)  
Target
Name:
5-hydroxytryptamine receptor 1D
Synonyms:
5-HT-1D 5-HT1D 5HT1D_HUMAN HTR1DA Serotonin (5-HT) receptor | Serotonin Receptor 1D
Type:
G Protein-Coupled Receptor (GPCR)
Mol. Mass.:
41920.63
Organism:
Homo sapiens (Human)
Description:
Receptor binding assays were performed using human clone stably expressed in CHO cells.
Residue:
377
  
Inhibitor
Name:
BDBM50049085
Synonyms:
1-[3-(2-Amino-ethyl)-1H-indol-5-yl]-ethanone CHEMBL110317
Type:
Small organic molecule
Emp. Form.:
C12H14N2O
Mol. Mass.:
202.2524
SMILES:
CC(=O)c1ccc2[nH]cc(CCN)c2c1
: