Target
4-aminobutyrate aminotransferase, mitochondrial
Ligand
BDBM50049260
Substrate
Meas. Tech.
ChEMBL_70659 (CHEMBL678649)
Ki
300±n/a nM
Citation
 Lightcap, ESSilverman, RB Slow-binding inhibition of gamma-aminobutyric acid aminotransferase by hydrazine analogues. J Med Chem 39:686-94 (1996)  
Target
Name:
4-aminobutyrate aminotransferase, mitochondrial
Synonyms:
(S)-3-amino-2-methylpropionate transaminase 2.6.1.22 ABAT GABA transaminase GABA-T GABT_PIG L-AIBAT
Type:
Mol. Mass.:
56633.06
Organism:
Sus scrofa
Description:
Residue:
500
  
Inhibitor
Name:
BDBM50049260
Synonyms:
3-Hydrazinomethyl-phenol | CHEMBL352205
Type:
Small organic molecule
Emp. Form.:
C7H10N2O
Mol. Mass.:
138.1671
SMILES:
NNCc1cccc(O)c1
: