Target
DNA topoisomerase 1
Ligand
BDBM50049296
Substrate
Meas. Tech.
ChEMBL_53713 (CHEMBL663641)
IC50
190±n/a nM
Citation
 Lackey, KSternbach, DDCroom, DKEmerson, DLEvans, MGLeitner, PLLuzzio, MJMcIntyre, GVuong, AYates, JBesterman, JM Water soluble inhibitors of topoisomerase I: quaternary salt derivatives of camptothecin. J Med Chem 39:713-9 (1996)  
Target
Name:
DNA topoisomerase 1
Synonyms:
DNA topoisomerase I TOP1 | TOP1_HUMAN
Type:
Enzyme
Mol. Mass.:
90771.02
Organism:
Homo sapiens (Human)
Description:
P11387
Residue:
765
  
Inhibitor
Name:
BDBM50049296
Synonyms:
7-ethyl-7-hydroxy-14-pyridazin-1-ium-1-ylmethyl-(7S)-7,8,11,13-tetrahydro-10H-[1,3]dioxolo[5,4-g]pyrano[3',4':6,7]indolizino[1,2-b]quinoline-8,11-dione | CHEMBL350270
Type:
Small organic molecule
Emp. Form.:
C26H21N4O6
Mol. Mass.:
485.4676
SMILES:
CC[C@@]1(O)C(=O)OCc2c1cc1-c3nc4cc5OCOc5cc4c(C[n+]4ccccn4)c3Cn1c2=O
: