Target
Growth hormone secretagogue receptor type 1
Ligand
BDBM50049479
Substrate
Meas. Tech.
ChEMBL_72512 (CHEMBL685177)
Ki
6±n/a nM
Citation
 Dean, DCNargund, RPPong, SSChaung, LYGriffin, PMelillo, DGEllsworth, RLVan der Ploeg, LHPatchett, AASmith, RG Development of a high specific activity sulfur-35-labeled sulfonamide radioligand that allowed the identification of a new growth hormone secretagogue receptor. J Med Chem 39:1767-70 (1996)  
Target
Name:
Growth hormone secretagogue receptor type 1
Synonyms:
GH-releasing peptide receptor GHS-R GHSR_HUMAN Ghrelin receptor | Ghrelin receptor 1a (GHS-R1a)
Type:
Receptor
Mol. Mass.:
41334.57
Organism:
Homo sapiens (Human)
Description:
Receptor binding studies use plasma membranes from LLC PK-1 cells transiently transfected with hGHSR1a.
Residue:
366
  
Inhibitor
Name:
BDBM50049479
Synonyms:
(S)-6-Amino-2-{(R)-2-[(S)-2-{(S)-2-[(R)-2-[(S)-2-amino-3-(1H-imidazol-4-yl)-propionylamino]-3-(1H-indol-3-yl)-propionylamino]-propionylamino}-3-(1H-indol-3-yl)-propionylamino]-3-phenyl-propionylamino}-hexanoic acid amide CHEMBL105462
Type:
Small organic molecule
Emp. Form.:
C46H56N12O6
Mol. Mass.:
873.0136
SMILES:
C[C@H](NC(=O)[C@@H](Cc1c[nH]c2ccccc12)NC(=O)[C@@H](N)Cc1cnc[nH]1)C(=O)N[C@@H](Cc1c[nH]c2ccccc12)C(=O)N[C@H](Cc1ccccc1)C(=O)N[C@@H](CCCCN)C(N)=O
: