Target
Tyrosine-protein phosphatase non-receptor type 1
Ligand
BDBM50500145
Substrate
Meas. Tech.
ChEMBL_1546980 (CHEMBL3748083)
Ki
1.4±n/a nM
Citation
 Kozakov, DHall, DRNapoleon, RLYueh, CWhitty, AVajda, S New Frontiers in Druggability. J Med Chem 58:9063-88 (2015)  
Target
Name:
Tyrosine-protein phosphatase non-receptor type 1
Synonyms:
PTN1_HUMAN PTPN1 Protein tyrosine phosphatase-1B (PTP1B) Protein-tyrosine phosphatase 1B (PTP1B) Tyrosine-protein phosphatase non-receptor type 1 (PTP1B)
Type:
Protein phosphatase
Mol. Mass.:
49963.76
Organism:
Homo sapiens (Human)
Description:
Human recombinant GST-fusion PTP1B (1-435).
Residue:
435
  
Inhibitor
Name:
BDBM50500145
Synonyms:
CHEMBL1235987
Type:
Small organic molecule
Emp. Form.:
C32H41F4N5O13P2S
Mol. Mass.:
873.7
SMILES:
NC(=O)[C@@H](CS)NC(=O)CCCCCNC(=O)[C@H](Cc1ccc(cc1)C(F)(F)P(O)(O)=O)NC(=O)[C@@H](CC(O)=O)NC(=O)Cc1ccc(cc1)C(F)(F)P(O)(O)=O
: