Target
Neuropeptide Y receptor type 1
Ligand
BDBM50500155
Substrate
Meas. Tech.
ChEMBL_1543525 (CHEMBL3750526)
Kd
0.044000±n/a nM
Citation
 Keller, MWeiss, SHutzler, CKuhn, KKMollereau, CDukorn, SSchindler, LBernhardt, GKönig, BBuschauer, A N(?)-Carbamoylation of the Argininamide Moiety: An Avenue to Insurmountable NPY Y1 Receptor Antagonists and a Radiolabeled Selective High-Affinity Molecular Tool ([(3)H]UR-MK299) with Extended Residence Time. J Med Chem 58:8834-49 (2015)  
Target
Name:
Neuropeptide Y receptor type 1
Synonyms:
NPY-Y1 NPY1R NPYR neuropeptide Y receptor Y1
Type:
Enzyme Catalytic Domain
Mol. Mass.:
44399.07
Organism:
Homo sapiens (Human)
Description:
NPY-Y1 NPY1R HUMAN::P25929
Residue:
384
  
Inhibitor
Name:
BDBM50500155
Synonyms:
CHEMBL3747715
Type:
Small organic molecule
Emp. Form.:
C33H41N7O5
Mol. Mass.:
619.7388
SMILES:
[3H]CC([3H])C(=O)NCCNC(=O)\N=C(\N)NCCC[C@@H](NC(=O)C(c1ccccc1)c1ccccc1)C(=O)NCc1ccc(O)cc1
: