Target
Glucokinase regulatory protein
Ligand
BDBM50500195
Substrate
Meas. Tech.
ChEMBL_1545299 (CHEMBL3751192)
IC50
160±n/a nM
Citation
 Pennington, LDBartberger, MDCroghan, MDAndrews, KLAshton, KSBourbeau, MPChen, JChmait, SCupples, RFotsch, CHelmering, JHong, FTHungate, RWJordan, SRKong, KLiu, LMichelsen, KMoyer, CNishimura, NNorman, MHReichelt, ASiegmund, ACSivits, GTadesse, STegley, CMVan, GYang, KCYao, GZhang, JLloyd, DJHale, CSt Jean, DJ Discovery and Structure-Guided Optimization of Diarylmethanesulfonamide Disrupters of Glucokinase-Glucokinase Regulatory Protein (GK-GKRP) Binding: Strategic Use of a N ? S (nN ? ?*S-X) Interaction for Conformational Constraint. J Med Chem 58:9663-79 (2015)  
Target
Name:
Glucokinase regulatory protein
Synonyms:
GCKR GKRP | Glucokinase regulator
Type:
PROTEIN
Mol. Mass.:
68685.97
Organism:
Homo sapiens (Human)
Description:
ChEMBL_103091
Residue:
625
  
Inhibitor
Name:
BDBM50500195
Synonyms:
CHEMBL3746391
Type:
Small organic molecule
Emp. Form.:
C22H18ClN3O4S2
Mol. Mass.:
487.979
SMILES:
Clc1ccccc1[C@@H](NS(=O)(=O)c1ccc2OCCCOc2c1)c1nc2cccnc2s1
: