Target
Interleukin-1 receptor-associated kinase 1
Ligand
BDBM50500350
Substrate
Meas. Tech.
ChEMBL_1545811 (CHEMBL3748819)
IC50
15±n/a nM
Citation
 Hatcher, JMBahcall, MChoi, HGGao, YSim, TGeorge, RJänne, PAGray, NS Discovery of Inhibitors That Overcome the G1202R Anaplastic Lymphoma Kinase Resistance Mutation. J Med Chem 58:9296-9308 (2015)  
Target
Name:
Interleukin-1 receptor-associated kinase 1
Synonyms:
IRAK IRAK1 Interleukin-1 receptor-associated kinase 1 (IRAK-1)
Type:
Enzyme
Mol. Mass.:
76536.81
Organism:
Homo sapiens (Human)
Description:
P51617
Residue:
712
  
Inhibitor
Name:
BDBM50500350
Synonyms:
CHEMBL3746678
Type:
Small organic molecule
Emp. Form.:
C29H31N5O
Mol. Mass.:
465.5893
SMILES:
CCc1cc2C(=O)c3c([nH]c4cc(ccc34)C#N)C(C)(C)c2cc1-c1cnn(CCCN(C)C)c1
: