Target
Proto-oncogene tyrosine-protein kinase receptor Ret
Ligand
BDBM50500350
Substrate
Meas. Tech.
ChEMBL_1545843 (CHEMBL3749183)
IC50
9.0±n/a nM
Citation
 Hatcher, JMBahcall, MChoi, HGGao, YSim, TGeorge, RJänne, PAGray, NS Discovery of Inhibitors That Overcome the G1202R Anaplastic Lymphoma Kinase Resistance Mutation. J Med Chem 58:9296-9308 (2015)  
Target
Name:
Proto-oncogene tyrosine-protein kinase receptor Ret
Synonyms:
CDHF12 Cadherin family member 12 Proto-oncogene c-Ret RET51 Tyrosine-protein kinase Ret (RET)
Type:
Protein
Mol. Mass.:
124318.29
Organism:
Homo sapiens (Human)
Description:
P07949
Residue:
1114
  
Inhibitor
Name:
BDBM50500350
Synonyms:
CHEMBL3746678
Type:
Small organic molecule
Emp. Form.:
C29H31N5O
Mol. Mass.:
465.5893
SMILES:
CCc1cc2C(=O)c3c([nH]c4cc(ccc34)C#N)C(C)(C)c2cc1-c1cnn(CCCN(C)C)c1
: