Target
Carbonic anhydrase 7
Ligand
BDBM50500678
Substrate
Meas. Tech.
ChEMBL_1549337 (CHEMBL3755043)
Ki
0.280000±n/a nM
Citation
 Villalba, MLPalestro, PCeruso, MGonzalez Funes, JLTalevi, ABruno Blanch, LSupuran, CTGavernet, L Sulfamide derivatives with selective carbonic anhydrase VII inhibitory action. Bioorg Med Chem 24:894-901 (2016)  
Target
Name:
Carbonic anhydrase 7
Synonyms:
CA-VII CAH7_HUMAN Carbonic anhydrase Carbonic anhydrase VII (CA VII)
Type:
Enzyme
Mol. Mass.:
29664.11
Organism:
Homo sapiens (Human)
Description:
Human cloned isozyme.
Residue:
264
  
Inhibitor
Name:
BDBM50500678
Synonyms:
CHEMBL3752328
Type:
Small organic molecule
Emp. Form.:
C17H19FN2O4S
Mol. Mass.:
366.407
SMILES:
COC(=O)[C@H](Cc1ccccc1)NS(=O)(=O)NCc1ccc(F)cc1
: