Target
cGMP-specific 3',5'-cyclic phosphodiesterase
Ligand
BDBM50050575
Substrate
Meas. Tech.
ChEMBL_155200 (CHEMBL763673)
IC50
4±n/a nM
Citation
 Dumaître, BDodic, N Synthesis and cyclic GMP phosphodiesterase inhibitory activity of a series of 6-phenylpyrazolo[3,4-d]pyrimidones. J Med Chem 39:1635-44 (1996)  
Target
Name:
cGMP-specific 3',5'-cyclic phosphodiesterase
Synonyms:
3',5'-cyclic phosphodiesterase PDE5 PDE5A_HUMAN Phosphodiesterase 5 (PDE5) Phosphodiesterase 5A (PDE5A) cGMP-specific 3',5'-cyclic phosphodiesterase
Type:
Protein
Mol. Mass.:
99975.83
Organism:
Homo sapiens (Human)
Description:
O76074
Residue:
875
  
Inhibitor
Name:
BDBM50050575
Synonyms:
1,3-Dimethyl-6-(5-nitro-2-propoxy-phenyl)-1,5-dihydro-pyrazolo[3,4-d]pyrimidin-4-one | CHEMBL290402
Type:
Small organic molecule
Emp. Form.:
C16H17N5O4
Mol. Mass.:
343.3373
SMILES:
CCCOc1ccc(cc1-c1nc2n(C)nc(C)c2c(=O)[nH]1)[N+]([O-])=O
: