Target
Catenin beta-1/Transcription factor 4
Ligand
BDBM50500847
Substrate
Meas. Tech.
ChEMBL_1565175 (CHEMBL3782567)
IC50
8700±n/a nM
Citation
 Radwan, AAAl-Mohanna, FAlanazi, FKManogaran, PSAl-Dhfyan, A Target ?-catenin/CD44/Nanog axis in colon cancer cells by certain N'-(2-oxoindolin-3-ylidene)-2-(benzyloxy)benzohydrazides. Bioorg Med Chem Lett 26:1664-70 (2016)  
Target
Name:
Catenin beta-1/Transcription factor 4
Synonyms:
TCF4-CTNNB1 complex
Type:
Mol. Mass.:
Description:
ASSAY_ID of ChEMBL is 1565175
Components:
This complex has 2 components.
Component 1
Name:
Catenin beta-1
Synonyms:
CTNB1_HUMAN CTNNB1
Type:
PROTEIN
Mol. Mass.:
85484.08
Organism:
Homo sapiens (Human)
Description:
ChEMBL_1504364
Residue:
781
  
Component 2
Name:
Transcription factor 4
Synonyms:
BHLHB19 ITF-2 ITF2_HUMAN SEF-2 SL3-3 enhancer factor 2 TCF4 | Transcription factor 4
Type:
PROTEIN
Mol. Mass.:
71315.43
Organism:
Homo sapiens
Description:
ChEMBL_117085
Residue:
667
  
Inhibitor
Name:
BDBM50500847
Synonyms:
Cercosporin
Type:
Small organic molecule
Emp. Form.:
C29H26O10
Mol. Mass.:
534.5107
SMILES:
COc1c(CC(C)O)c2c3c(CC(C)O)c(OC)c(=O)c4c(O)cc5OCOc6cc(O)c(c2c6c5c34)c1=O
: