Target
Ribonucleoside-diphosphate reductase large subunit
Ligand
BDBM50050825
Substrate
Meas. Tech.
ChEMBL_195387 (CHEMBL806876)
IC50
108±n/a nM
Citation
 Moss, NBeaulieu, PDuceppe, JSFerland, JMGauthier, JGhiro, EGoulet, SGuse, ILlinàs-Brunet, MPlante, RPlamondon, LWernic, DDéziel, R Ureido-based peptidomimetic inhibitor of herpes simplex virus ribonucleotide reductase: an investigation of inhibitor bioactive conformation. J Med Chem 39:2178-87 (1996)  
Target
Name:
Ribonucleoside-diphosphate reductase large subunit
Synonyms:
ICP6 RIR1 Ribonucleoside-diphosphate reductase large chain Ribonucleotide reductase 136 kDa subunit | Ribonucleotide reductase large subunit
Type:
PROTEIN
Mol. Mass.:
124049.68
Organism:
Human herpesvirus 1 (strain 17) (HHV-1) (Human herpes simplex virus1)
Description:
ChEMBL_195109
Residue:
1137
  
Inhibitor
Name:
BDBM50050825
Synonyms:
(S)-2-((S)-3-Carboxy-2-{[1-{(S)-2-[3-(1-ethyl-propyl)-ureido]-3,3-dimethyl-butyryl}-3-(pyrrolidine-1-carbonyl)-pyrrolidine-2-carbonyl]-amino}-propionylamino)-4-methyl-pentanoic acid | CHEMBL2369482
Type:
Small organic molecule
Emp. Form.:
C32H54N6O9
Mol. Mass.:
666.806
SMILES:
CCC(CC)NC(=O)N[C@H](C(=O)N1CCC([C@H]1C(=O)N[C@@H](CC(O)=O)C(=O)N[C@@H](CC(C)C)C(O)=O)C(=O)N1CCCC1)C(C)(C)C
: