Target
fMet-Leu-Phe receptor
Ligand
BDBM50050931
Substrate
Meas. Tech.
ChEMBL_88340 (CHEMBL699999)
IC50
600±n/a nM
Citation
 Higgins, JDBridger, GJDerian, CKBeblavy, MJHernandez, PEGaul, FEAbrams, MJPike, MCSolomon, HF N-terminus urea-substituted chemotactic peptides: new potent agonists and antagonists toward the neutrophil fMLF receptor. J Med Chem 39:1013-5 (1996)  
Target
Name:
fMet-Leu-Phe receptor
Synonyms:
FPR FPR1_HUMAN N-formyl peptide receptor 1 fMLP receptor formyl peptide receptor 1
Type:
Enzyme Catalytic Domain
Mol. Mass.:
38456.14
Organism:
Homo sapiens (Human)
Description:
gi_4503779
Residue:
350
  
Inhibitor
Name:
BDBM50050931
Synonyms:
(S)-2-[(R)-2-((S)-2-{(R)-2-[(S)-2-(3-Butyl-ureido)-3-phenyl-propionylamino]-4-methyl-pentanoylamino}-3-phenyl-propionylamino)-4-methyl-pentanoylamino]-3-phenyl-propionic acid | CHEMBL7363
Type:
Small organic molecule
Emp. Form.:
C44H60N6O7
Mol. Mass.:
784.9832
SMILES:
CCCCNC(=O)N[C@@H](Cc1ccccc1)C(=O)N[C@H](CC(C)C)C(=O)N[C@@H](Cc1ccccc1)C(=O)N[C@H](CC(C)C)C(=O)N[C@@H](Cc1ccccc1)C(O)=O
: