Target
Sodium channel protein type 9 subunit alpha
Ligand
BDBM344700
Substrate
Meas. Tech.
ChEMBL_1573401 (CHEMBL3804563)
IC50
840±n/a nM
Citation
 Frost, JMDeGoey, DAShi, LGum, RJFricano, MMLundgaard, GLEl-Kouhen, OFHsieh, GCNeelands, TMatulenko, MADaanen, JFPai, MGhoreishi-Haack, NZhan, CZhang, XFKort, ME Substituted Indazoles as Nav1.7 Blockers for the Treatment of Pain. J Med Chem 59:3373-91 (2016)  
Target
Name:
Sodium channel protein type 9 subunit alpha
Synonyms:
NENA Peripheral sodium channel 1 SCN9A_HUMAN Voltage-gated sodium channel subunit Nav1.7 hNE-Na
Type:
Protein
Mol. Mass.:
226375.97
Organism:
Homo sapiens (Human)
Description:
Q15858
Residue:
1988
  
Inhibitor
Name:
BDBM344700
Synonyms:
2-{3-[1-(2-fluorophenyl)-1H-indazol-4-yl]-2-oxoimidazolidin-1-yl}acetamide | US9783527, Example 3
Type:
Small organic molecule
Emp. Form.:
C18H16FN5O2
Mol. Mass.:
353.3503
SMILES:
NC(=O)CN1CCN(C1=O)c1cccc2n(ncc12)-c1ccccc1F
: