Target
Sodium channel protein type 9 subunit alpha
Ligand
BDBM344698
Substrate
Meas. Tech.
ChEMBL_1573404 (CHEMBL3804566)
IC50
990±n/a nM
Citation
 Frost, JMDeGoey, DAShi, LGum, RJFricano, MMLundgaard, GLEl-Kouhen, OFHsieh, GCNeelands, TMatulenko, MADaanen, JFPai, MGhoreishi-Haack, NZhan, CZhang, XFKort, ME Substituted Indazoles as Nav1.7 Blockers for the Treatment of Pain. J Med Chem 59:3373-91 (2016)  
Target
Name:
Sodium channel protein type 9 subunit alpha
Synonyms:
NENA Peripheral sodium channel 1 SCN9A_HUMAN Voltage-gated sodium channel subunit Nav1.7 hNE-Na
Type:
Protein
Mol. Mass.:
226375.97
Organism:
Homo sapiens (Human)
Description:
Q15858
Residue:
1988
  
Inhibitor
Name:
BDBM344698
Synonyms:
1-[1-(2-fluorophenyl)-1H-indazol-4-yl]-3-[2-oxo-2-(pyrrolidin-1-yl)ethyl]imidazolidin-2-one | US9783527, Example 1
Type:
Small organic molecule
Emp. Form.:
C22H22FN5O2
Mol. Mass.:
407.4408
SMILES:
Fc1ccccc1-n1ncc2c(cccc12)N1CCN(CC(=O)N2CCCC2)C1=O
: