Target
Adenosylhomocysteinase
Ligand
BDBM50051437
Substrate
Meas. Tech.
ChEMBL_196745 (CHEMBL803155)
Ki
4500±n/a nM
Citation
 Liu, SYuan, CSBorchardt, RT Aristeromycin-5'-carboxaldehyde: a potent inhibitor of S-adenosyl-L-homocysteine hydrolase. J Med Chem 39:2347-53 (1996)  
Target
Name:
Adenosylhomocysteinase
Synonyms:
AHCY SAHH | SAHH_HUMAN
Type:
PROTEIN
Mol. Mass.:
47714.06
Organism:
Homo sapiens (Human)
Description:
ChEMBL_1507791
Residue:
432
  
Inhibitor
Name:
BDBM50051437
Synonyms:
(1S,2R,3S,4R)-4-(6-Amino-purin-9-yl)-2,3-dihydroxy-cyclopentanecarbaldehyde | CHEMBL76858
Type:
Small organic molecule
Emp. Form.:
C11H13N5O3
Mol. Mass.:
263.2526
SMILES:
Nc1ncnc2n(cnc12)[C@@H]1C[C@H](C=O)[C@@H](O)[C@H]1O
: