Target
B-cell CLL/lymphoma 9 protein
Ligand
BDBM50501082
Substrate
Meas. Tech.
ChEMBL_1586628 (CHEMBL3821983)
Ki
53000±n/a nM
Citation
 Wisniewski, JAYin, JTeuscher, KBZhang, MJi, H Structure-Based Design of 1,4-Dibenzoylpiperazines as ?-Catenin/B-Cell Lymphoma 9 Protein-Protein Interaction Inhibitors. ACS Med Chem Lett 7:508-13 (2016)  
Target
Name:
B-cell CLL/lymphoma 9 protein
Synonyms:
B-cell CLL/lymphoma 9 protein BCL9 Bcl-9 | Protein legless homolog
Type:
PROTEIN
Mol. Mass.:
149313.19
Organism:
Homo sapiens
Description:
ChEMBL_117069
Residue:
1426
  
Inhibitor
Name:
BDBM50501082
Synonyms:
CHEMBL3818667
Type:
Small organic molecule
Emp. Form.:
C31H42Cl2FN5O3
Mol. Mass.:
622.601
SMILES:
Cl.Cl.Fc1cc(cc(c1)C(=O)N1CCN(CC1)C(=O)c1ccc(O[C@H]2CCNC2)c(c1)C1CCCC1)N1CCNCC1
: