Target
Xanthine dehydrogenase/oxidase
Ligand
BDBM50051714
Substrate
Meas. Tech.
ChEMBL_217080 (CHEMBL823476)
Ki
260±n/a nM
Citation
 Biagi, GCostantini, ACostantino, LGiorgi, ILivi, OPecorari, PRinaldi, MScartoni, V Synthesis and biological evaluation of new imidazole, pyrimidine, and purine derivatives and analogs as inhibitors of xanthine oxidase. J Med Chem 39:2529-35 (1996)  
Target
Name:
Xanthine dehydrogenase/oxidase
Synonyms:
XD XDHA XO Xanthine dehydrogenase/oxidase | Xanthine oxidase
Type:
Enzyme
Mol. Mass.:
146441.21
Organism:
Homo sapiens (Human)
Description:
P47989
Residue:
1333
  
Inhibitor
Name:
BDBM50051714
Synonyms:
CHEMBL85737 | N-(5-Carbamoyl-3H-imidazol-4-yl)-oxalamic acid hexyl ester
Type:
Small organic molecule
Emp. Form.:
C12H18N4O4
Mol. Mass.:
282.2957
SMILES:
CCCCCCOC(=O)C(=O)Nc1nc[nH]c1C(N)=O
: