Target
Sterol O-acyltransferase 1
Ligand
BDBM50051897
Substrate
Meas. Tech.
ChEMBL_28659 (CHEMBL885300)
IC50
1300±n/a nM
Citation
 Astles, PCAshton, MJBridge, AWHarris, NVHart, TWParrott, DPPorter, BRiddell, DSmith, CWilliams, RJ Acyl-CoA:Cholesterol O-acyltransferase (ACAT) inhibitors. 2. 2-(1,3-Dioxan-2-yl)-4,5-diphenyl-1H-imidazoles as potent inhibitors of ACAT. J Med Chem 39:1423-32 (1996)  
Target
Name:
Sterol O-acyltransferase 1
Synonyms:
ACACT ACAT Acetyl-CoA acetyltransferase, mitochondrial Acyl-CoA: cholesterol acyltransferase (ACAT) Cholesterol acyltransferase 1 SOAT1 STAT
Type:
Multi-pass membrane protein may form homo- or heterodimers.
Mol. Mass.:
64751.94
Organism:
Homo sapiens (Human)
Description:
P35610
Residue:
550
  
Inhibitor
Name:
BDBM50051897
Synonyms:
2-(5,5-Diethyl-[1,3]dioxan-2-yl)-4,5-diphenyl-1H-imidazole | CHEMBL33842
Type:
Small organic molecule
Emp. Form.:
C23H26N2O2
Mol. Mass.:
362.4647
SMILES:
CCC1(CC)COC(OC1)c1nc(c([nH]1)-c1ccccc1)-c1ccccc1
: