Target
Sterol O-acyltransferase 1
Ligand
BDBM50051898
Substrate
Meas. Tech.
ChEMBL_28658 (CHEMBL643993)
IC50
50±n/a nM
Citation
 Astles, PCAshton, MJBridge, AWHarris, NVHart, TWParrott, DPPorter, BRiddell, DSmith, CWilliams, RJ Acyl-CoA:Cholesterol O-acyltransferase (ACAT) inhibitors. 2. 2-(1,3-Dioxan-2-yl)-4,5-diphenyl-1H-imidazoles as potent inhibitors of ACAT. J Med Chem 39:1423-32 (1996)  
Target
Name:
Sterol O-acyltransferase 1
Synonyms:
ACACT ACAT Acetyl-CoA acetyltransferase, mitochondrial Acyl-CoA: cholesterol acyltransferase (ACAT) Cholesterol acyltransferase 1 SOAT1 STAT
Type:
Multi-pass membrane protein may form homo- or heterodimers.
Mol. Mass.:
64751.94
Organism:
Homo sapiens (Human)
Description:
P35610
Residue:
550
  
Inhibitor
Name:
BDBM50051898
Synonyms:
1-{4-[2-(4,5-Diphenyl-1H-imidazol-2-yl)-5-methyl-[1,3]dioxan-5-yl]-butyl}-4-thiazol-2-yl-piperazine | CHEMBL34219
Type:
Small organic molecule
Emp. Form.:
C31H37N5O2S
Mol. Mass.:
543.723
SMILES:
CC1(CCCCN2CCN(CC2)c2nccs2)COC(OC1)c1nc(c([nH]1)-c1ccccc1)-c1ccccc1
: