Target
Retinoic acid receptor RXR-alpha
Ligand
BDBM31892
Substrate
Meas. Tech.
ChEMBL_196903 (CHEMBL807187)
EC50
316±n/a nM
Citation
 Zhang, LNadzan, AMHeyman, RALove, DLMais, DECroston, GLamph, WWBoehm, MF Discovery of novel retinoic acid receptor agonists having potent antiproliferative activity in cervical cancer cells. J Med Chem 39:2659-63 (1996)  
Target
Name:
Retinoic acid receptor RXR-alpha
Synonyms:
NR2B1 Nuclear receptor subfamily 4 group A member 2 RXRA Retinoic acid receptor RXR-alpha/gamma Retinoid receptor
Type:
PROTEIN
Mol. Mass.:
50820.38
Organism:
Homo sapiens (Human)
Description:
ChEMBL_1456363
Residue:
462
  
Inhibitor
Name:
BDBM31892
Synonyms:
9-cis retinoic acid CHEMBL705 alitretinoin
Type:
Small organic molecule
Emp. Form.:
C20H28O2
Mol. Mass.:
300.4351
SMILES:
C\C(\C=C\C1=C(C)CCCC1(C)C)=C\C=C\C(\C)=C\C(O)=O
: