Target
Cyclin-dependent kinase 6/G1/S-specific cyclin-D3
Ligand
BDBM50501589
Substrate
Meas. Tech.
ChEMBL_1656374 (CHEMBL4005844)
Ki
82±n/a nM
Citation
 Tadesse, SYu, MMekonnen, LBLam, FIslam, STomusange, KRahaman, MHNoll, BBasnet, SKTeo, TAlbrecht, HMilne, RWang, S Highly Potent, Selective, and Orally Bioavailable 4-Thiazol-N-(pyridin-2-yl)pyrimidin-2-amine Cyclin-Dependent Kinases 4 and 6 Inhibitors as Anticancer Drug Candidates: Design, Synthesis, and Evaluation. J Med Chem 60:1892-1915 (2017)  
Target
Name:
Cyclin-dependent kinase 6/G1/S-specific cyclin-D3
Synonyms:
CDK6/CycD3 CDK6/G1/S-specific cyclin D3 Cyclin-dependent kinase 6 | Cyclin-dependent kinase 6/G1/S-specific cyclin D3
Type:
Protein
Mol. Mass.:
Description:
Components:
This complex has 2 components.
Component 1
Name:
Cyclin-dependent kinase 6
Synonyms:
CDK6 CDKN6 Cyclin-dependent kinase 6 (CDK 6) | Serine/threonine-protein kinase PLSTIRE
Type:
Enzyme Subunit
Mol. Mass.:
36937.42
Organism:
Homo sapiens (Human)
Description:
Q00534
Residue:
326
  
Component 2
Name:
G1/S-specific cyclin-D3
Synonyms:
CCND3 | CCND3_HUMAN
Type:
Enzyme
Mol. Mass.:
32521.90
Organism:
Homo sapiens (Human)
Description:
P30281
Residue:
292
  
Inhibitor
Name:
BDBM50501589
Synonyms:
CHEMBL4100252
Type:
Small organic molecule
Emp. Form.:
C20H25N7OS
Mol. Mass.:
411.524
SMILES:
CC(C)Nc1nc(C)c(s1)-c1ccnc(Nc2ccc(cn2)N2CCOCC2)n1
: