Target
Cyclin-dependent kinase 4/G1/S-specific cyclin-D1
Ligand
BDBM50501605
Substrate
Meas. Tech.
ChEMBL_1656373 (CHEMBL4005843)
Ki
2.0±n/a nM
Citation
 Tadesse, SYu, MMekonnen, LBLam, FIslam, STomusange, KRahaman, MHNoll, BBasnet, SKTeo, TAlbrecht, HMilne, RWang, S Highly Potent, Selective, and Orally Bioavailable 4-Thiazol-N-(pyridin-2-yl)pyrimidin-2-amine Cyclin-Dependent Kinases 4 and 6 Inhibitors as Anticancer Drug Candidates: Design, Synthesis, and Evaluation. J Med Chem 60:1892-1915 (2017)  
Target
Name:
Cyclin-dependent kinase 4/G1/S-specific cyclin-D1
Synonyms:
CDK4/CycD CDK4/Cyclin D1 Cyclin-Dependent Kinase 4 (CDK4) Cyclin-dependent kinase 4/G1/S-specific cyclin D1 | Cyclin-dependent kinase 4/cyclin D1
Type:
Protein Complex
Mol. Mass.:
Description:
CDK4/D1 complexes were purified from insect cells co-infected with baculovirus vectors containing each of the components.
Components:
This complex has 2 components.
Component 1
Name:
Cyclin-dependent kinase 4
Synonyms:
CDK4 Cell division protein kinase 4 PSK-J3
Type:
Enzyme Subunit
Mol. Mass.:
33731.96
Organism:
Homo sapiens (Human)
Description:
P11802
Residue:
303
  
Component 2
Name:
G1/S-specific cyclin-D1
Synonyms:
B-cell lymphoma 1 protein BCL-1 oncogene CCND1 PRAD1 | PRAD1 oncogene
Type:
Enzyme Subunit
Mol. Mass.:
33717.70
Organism:
Homo sapiens (Human)
Description:
Residue:
295
  
Inhibitor
Name:
BDBM50501605
Synonyms:
CHEMBL4102935
Type:
Small organic molecule
Emp. Form.:
C23H30N8S
Mol. Mass.:
450.603
SMILES:
CN(C1CCCC1)c1nc(C)c(s1)-c1ccnc(Nc2ccc(cn2)N2CCNCC2)n1
: