Target
Genome polyprotein
Ligand
BDBM50501749
Substrate
Meas. Tech.
ChEMBL_1678288 (CHEMBL4028431)
Ki
393000±n/a nM
Citation
 Schulz, RAtef, ABecker, DGottschalk, FTauber, CWagner, SArkona, CAbdel-Hafez, AAFarag, HHRademann, JWolber, G Phenylthiomethyl Ketone-Based Fragments Show Selective and Irreversible Inhibition of Enteroviral 3C Proteases. J Med Chem 61:1218-1230 (2018)  
Target
Name:
Genome polyprotein
Synonyms:
3C-like proteinase (CVB3 3Cpro) P1A P1C P2A P2C P3B P3D-POL Picornain 3C Protease 2A Protein 2A Protein 2C Protein 3B Protein VP1 Protein VP3 RNA-directed RNA polymerase 3D-POL VPg Virion protein 2 Virion protein 4
Type:
Enzyme
Mol. Mass.:
243464.96
Organism:
Coxsackievirus B3 (strain Nancy)
Description:
P03313
Residue:
2185
  
Inhibitor
Name:
BDBM50501749
Synonyms:
CHEMBL4068292
Type:
Small organic molecule
Emp. Form.:
C12H13NO4
Mol. Mass.:
235.2359
SMILES:
CC1(C)CC(=O)c2cc(C(N)=O)c(=O)oc2C1
: