Target
UDP-3-O-acyl-N-acetylglucosamine deacetylase
Ligand
BDBM50501756
Substrate
Meas. Tech.
ChEMBL_1699652 (CHEMBL4050634)
IC50
18±n/a nM
Citation
 Zhang, JChan, ALippa, BCross, JBLiu, CYin, NRomero, JALawrence, JHeney, RHerradura, PGoss, JClark, CAbel, CZhang, YPoutsiaka, KMEpie, FConrad, MMahamoon, ANguyen, KChavan, AClark, ELi, TCCheng, RKWood, MAndersen, OABrooks, MKwong, JBarker, JParr, IBGu, YRyan, MDColeman, SMetcalf, CA Structure-based discovery of LpxC inhibitors. Bioorg Med Chem Lett 27:1670-1680 (2017)  
Target
Name:
UDP-3-O-acyl-N-acetylglucosamine deacetylase
Synonyms:
LPXC_PSEAE UDP-3-O-[3-hydroxymyristoyl] N-acetylglucosamine deacetylase UDP-3-O-[3-hydroxymyristoyl] N-acetylglucosamine deacetylase (LpxC) UDP-3-O-acyl-GlcNAc deacetylase (LpxC) lpxC
Type:
Enzyme
Mol. Mass.:
33428.15
Organism:
Pseudomonas aeruginosa
Description:
P47205
Residue:
303
  
Inhibitor
Name:
BDBM50501756
Synonyms:
CHEMBL4066982
Type:
Small organic molecule
Emp. Form.:
C27H34N4O4
Mol. Mass.:
478.5833
SMILES:
C[C@@H](O)[C@H](NC1CCN(C)c2cc(ccc12)C#Cc1ccc(CN2CCOCC2)cc1)C(=O)NO
: