Target
UDP-3-O-acyl-N-acetylglucosamine deacetylase
Ligand
BDBM50501783
Substrate
Meas. Tech.
ChEMBL_1699648 (CHEMBL4050630)
IC50
3.0±n/a nM
Citation
 Zhang, JChan, ALippa, BCross, JBLiu, CYin, NRomero, JALawrence, JHeney, RHerradura, PGoss, JClark, CAbel, CZhang, YPoutsiaka, KMEpie, FConrad, MMahamoon, ANguyen, KChavan, AClark, ELi, TCCheng, RKWood, MAndersen, OABrooks, MKwong, JBarker, JParr, IBGu, YRyan, MDColeman, SMetcalf, CA Structure-based discovery of LpxC inhibitors. Bioorg Med Chem Lett 27:1670-1680 (2017)  
Target
Name:
UDP-3-O-acyl-N-acetylglucosamine deacetylase
Synonyms:
LPXC_ECOLI UDP-3-O-[3-hydroxymyristoyl] N-acetylglucosamine deacetylase (LxpC) asmB lpxC
Type:
Enzyme
Mol. Mass.:
33952.00
Organism:
Escherichia coli
Description:
P0A725
Residue:
305
  
Inhibitor
Name:
BDBM50501783
Synonyms:
CHEMBL4064896
Type:
Small organic molecule
Emp. Form.:
C26H31N3O4
Mol. Mass.:
449.542
SMILES:
[H][C@]1(CCc2cc(ccc12)C#Cc1ccc(CN2CCOCC2)cc1)N[C@@H]([C@@H](C)O)C(=O)NO
: