Target
Metabotropic glutamate receptor 2
Ligand
BDBM50052255
Substrate
Meas. Tech.
ChEMBL_106224 (CHEMBL713619)
EC50
>300000±n/a nM
Citation
 Pellicciari, RRaimondo, MMarinozzi, MNatalini, BCostantino, GThomsen, C (S)-(+)-2-(3'-carboxybicyclo[1.1.1]pentyl)-glycine, a structurally new group I metabotropic glutamate receptor antagonist. J Med Chem 39:2874-6 (1996)  
Target
Name:
Metabotropic glutamate receptor 2
Synonyms:
GPRC1B GRM2_HUMAN Metabotropic glutamate receptor mGlu2 | metabotropic glutamate 2
Type:
Enzyme
Mol. Mass.:
95584.88
Organism:
Homo sapiens (Human)
Description:
Q14416
Residue:
872
  
Inhibitor
Name:
BDBM50052255
Synonyms:
3-((R)-Amino-carboxy-methyl)-bicyclo[1.1.1]pentane-1-carboxylic acid | CHEMBL97083
Type:
Small organic molecule
Emp. Form.:
C8H11NO4
Mol. Mass.:
185.1772
SMILES:
N[C@@H](C(O)=O)C12CC(C1)(C2)C(O)=O
: