Target
Metabotropic glutamate receptor 4
Ligand
BDBM50052255
Substrate
Meas. Tech.
ChEMBL_106703 (CHEMBL872015)
IC50
>300000±n/a nM
Citation
 Pellicciari, RRaimondo, MMarinozzi, MNatalini, BCostantino, GThomsen, C (S)-(+)-2-(3'-carboxybicyclo[1.1.1]pentyl)-glycine, a structurally new group I metabotropic glutamate receptor antagonist. J Med Chem 39:2874-6 (1996)  
Target
Name:
Metabotropic glutamate receptor 4
Synonyms:
GPRC1D GRM4_HUMAN MGLUR4 Metabotropic glutamate receptor 4 (mGlu4) metabotropic glutamate 4
Type:
Protein
Mol. Mass.:
101899.95
Organism:
Homo sapiens (Human)
Description:
Q14833
Residue:
912
  
Inhibitor
Name:
BDBM50052255
Synonyms:
3-((R)-Amino-carboxy-methyl)-bicyclo[1.1.1]pentane-1-carboxylic acid | CHEMBL97083
Type:
Small organic molecule
Emp. Form.:
C8H11NO4
Mol. Mass.:
185.1772
SMILES:
N[C@@H](C(O)=O)C12CC(C1)(C2)C(O)=O
: