Target
Metabotropic glutamate receptor 5
Ligand
BDBM50052256
Substrate
Meas. Tech.
ChEMBL_104303 (CHEMBL709918)
EC50
103000±n/a nM
Citation
 Pellicciari, RRaimondo, MMarinozzi, MNatalini, BCostantino, GThomsen, C (S)-(+)-2-(3'-carboxybicyclo[1.1.1]pentyl)-glycine, a structurally new group I metabotropic glutamate receptor antagonist. J Med Chem 39:2874-6 (1996)  
Target
Name:
Metabotropic glutamate receptor 5
Synonyms:
GPRC1E GRM5_HUMAN metabotropic glutamate 5 | metabotropic glutamate 5a
Type:
Enzyme
Mol. Mass.:
132484.72
Organism:
Homo sapiens (Human)
Description:
Residue:
1212
  
Inhibitor
Name:
BDBM50052256
Synonyms:
(S)-3-(amino(carboxy)methyl)bicyclo[1.1.1]pentane-1-carboxylic acid 3-(Amino-carboxy-methyl)-bicyclo[1.1.1]pentane-1-carboxylic acid(S-CBPG) CHEMBL43412
Type:
Small organic molecule
Emp. Form.:
C8H11NO4
Mol. Mass.:
185.1772
SMILES:
N[C@H](C(O)=O)C12CC(C1)(C2)C(O)=O
: