Target
Polyunsaturated fatty acid lipoxygenase ALOX12
Ligand
BDBM50052463
Substrate
Meas. Tech.
ChEMBL_207 (CHEMBL615241)
IC50
>30000±n/a nM
Citation
 Müller, KHuang, HSWiegrebe, W Antipsoriatic anthrones with modulated redox properties. 3. 10-thio-substituted 1,8-dihydroxy-9(10H)-anthracenones as inhibitors of keratinocyte growth, 5-lipoxygenase, and the formation of 12(S)-HETE in mouse epidermis. J Med Chem 39:3132-8 (1996)  
Target
Name:
Polyunsaturated fatty acid lipoxygenase ALOX12
Synonyms:
Alox12 Arachidonate 12-lipoxygenase | LOX12_MOUSE
Type:
PROTEIN
Mol. Mass.:
75384.34
Organism:
Mus musculus
Description:
ChEMBL_1290357
Residue:
663
  
Inhibitor
Name:
BDBM50052463
Synonyms:
1,8-Dihydroxy-10-propylsulfanyl-10H-anthracen-9-one | CHEMBL321110
Type:
Small organic molecule
Emp. Form.:
C17H16O3S
Mol. Mass.:
300.372
SMILES:
CCCSC1c2cccc(O)c2C(=O)c2c(O)cccc12
: