Target
Diacylglycerol O-acyltransferase 1
Ligand
BDBM50502590
Substrate
Meas. Tech.
ChEMBL_1808007 (CHEMBL4307366)
EC50
12±n/a nM
Citation
 Harrison, TJBauer, DBerdichevsky, AChen, XDuvadie, RHoogheem, BHatsis, PLiu, QMao, JMiduturu, VRocheford, EZecri, FZessis, RZheng, RZhu, QStreeper, RPatel, SJ Successful Strategies for Mitigation of a Preclinical Signal for Phototoxicity in a DGAT1 Inhibitor. ACS Med Chem Lett 10:1128-1133 (2019)  
Target
Name:
Diacylglycerol O-acyltransferase 1
Synonyms:
DGAT1_MOUSE Dgat1 Diacylglycerol O-acyltransferase 1 (DGAT1) | Diglyceride acyltransferase
Type:
Enzyme
Mol. Mass.:
56810.61
Organism:
Mus musculus (mouse)
Description:
In this assay, recombinant mouse DGAT-1 containing an N-terminal His6-epitope tag was produced in the baculovirus expression system.
Residue:
498
  
Inhibitor
Name:
BDBM50502590
Synonyms:
CHEMBL4434994
Type:
Small organic molecule
Emp. Form.:
C25H28N4O3
Mol. Mass.:
432.5148
SMILES:
OC(=O)C[C@H]1CC[C@@H](CC1)c1ccc(cc1)-c1ccc(Nc2nnc(o2)C2CCC2)cn1
: