Target
Retinoic acid receptor RXR-beta
Ligand
BDBM50052590
Substrate
Meas. Tech.
ChEMBL_197058 (CHEMBL804834)
Ki
12±n/a nM
Citation
 Canan Koch, SSDardashti, LJHebert, JJWhite, SKCroston, GEFlatten, KSHeyman, RANadzan, AM Identification of the first retinoid X, receptor homodimer antagonist. J Med Chem 39:3229-34 (1996)  
Target
Name:
Retinoic acid receptor RXR-beta
Synonyms:
NR2B2 RXRB Retinoic acid receptor RXR-beta Retinoid receptor
Type:
PROTEIN
Mol. Mass.:
56932.89
Organism:
Homo sapiens (Human)
Description:
ChEMBL_39045
Residue:
533
  
Inhibitor
Name:
BDBM50052590
Synonyms:
(2E,4E,6Z)-7-(3-Ethoxy-5,5,8,8-tetramethyl-5,6,7,8-tetrahydro-naphthalen-2-yl)-3-methyl-octa-2,4,6-trienoic acid | CHEMBL109847
Type:
Small organic molecule
Emp. Form.:
C25H34O3
Mol. Mass.:
382.5357
SMILES:
CCOc1cc2c(cc1\C(C)=C/C=C/C(/C)=C/C(O)=O)C(C)(C)CCC2(C)C
: